Reaction Details
TargetBromodomain-containing protein 4
LigandBDBM50028139
Substrate/Competitorn/a
Meas. Tech.ChEMBL_1434714 (CHEMBL3382829)
IC50 316±n/a nM
Citation Gosmini, RNguyen, VLToum, JSimon, CBrusq, JMKrysa, GMirguet, ORiou-Eymard, AMBoursier, EVTrottet, LBamborough, PClark, HChung, CWCutler, LDemont, EHKaur, RLewis, AJSchilling, MBSoden, PETaylor, SWalker, ALWalker, MDPrinjha, RKNicodème, E The discovery of I-BET726 (GSK1324726A), a potent tetrahydroquinoline ApoA1 up-regulator and selective BET bromodomain inhibitor. J Med Chem57:8111-31 (2014) 
 
Bromodomain-containing protein 4
Name:Bromodomain-containing protein 4
Type:Protein
Mol. Mass.:152264.84
Organism:Homo sapiens (Human)
Description:O60885
Residue:1362
BDBM50028139
NameBDBM50028139
Synonyms:CHEMBL3353997
TypeSmall organic molecule
Emp. Form.C26H26N2O5S
Mol. Mass.478.56
SMILESC[C@H]1C[C@@H](Nc2ccc(cc2)S(C)(=O)=O)c2cc(ccc2N1C(C)=O)-c1ccc(cc1)C(O)=O