Reaction Details
TargetLactase/phlorizin hydrolase
LigandBDBM50028175
Substrate/Competitorn/a
Meas. Tech.ChEMBL_1435478 (CHEMBL3384693)
IC50>100000±n/a nM
Citation Ghisaidoobe, ATvan den Berg, RJButt, SSStrijland, ADonker-Koopman, WEScheij, Svan den Nieuwendijk, AMKoomen, GJvan Loevezijn, ALeemhuis, MWennekes, Tvan der Stelt, Mvan der Marel, GAvan Boeckel, CAAerts, JMOverkleeft, HS Identification and development of biphenyl substituted iminosugars as improved dual glucosylceramide synthase/neutral glucosylceramidase inhibitors. J Med Chem57:9096-104 (2014) 
 
Lactase/phlorizin hydrolase
Name:Lactase/phlorizin hydrolase
Type:PROTEIN
Mol. Mass.:218576.40
Organism:Homo sapiens (Human)
Description:ChEMBL_1435478
Residue:1927
BDBM50028175
NameBDBM50028175
Synonyms:CHEMBL3354620
TypeSmall organic molecule
Emp. Form.C24H31F2NO5
Mol. Mass.451.5034
SMILESOC[C@@H]1[C@@H](O)[C@H](O)[C@@H](O)CN1CC(F)(F)CCCOCc1ccc(cc1)-c1ccccc1