Reaction Details
TargetNon-lysosomal glucosylceramidase
LigandBDBM50028217
Substrate/Competitorn/a
Meas. Tech.ChEMBL_1435476 (CHEMBL3384691)
IC50 1.000000±n/a nM
Citation Ghisaidoobe, ATvan den Berg, RJButt, SSStrijland, ADonker-Koopman, WEScheij, Svan den Nieuwendijk, AMKoomen, GJvan Loevezijn, ALeemhuis, MWennekes, Tvan der Stelt, Mvan der Marel, GAvan Boeckel, CAAerts, JMOverkleeft, HS Identification and development of biphenyl substituted iminosugars as improved dual glucosylceramide synthase/neutral glucosylceramidase inhibitors. J Med Chem57:9096-104 (2014) 
 
Non-lysosomal glucosylceramidase
Name:Non-lysosomal glucosylceramidase
Type:PROTEIN
Mol. Mass.:104639.04
Organism:Homo sapiens (Human)
Description:ChEMBL_1435476
Residue:927
BDBM50028217
NameBDBM50028217
Synonyms:CHEMBL3354037
TypeSmall organic molecule
Emp. Form.C28H33NO5
Mol. Mass.463.5653
SMILESOC[C@H]1[C@@H](O)[C@H](O)[C@@H](O)CN1CCCCCOCc1ccc2ccc3cccc4ccc1c2c34