Reaction Details
TargetCeramide glucosyltransferase
LigandBDBM50028253
Substrate/Competitorn/a
Meas. Tech.ChEMBL_1435474 (CHEMBL3384689)
IC50 15±n/a nM
Citation Ghisaidoobe, ATvan den Berg, RJButt, SSStrijland, ADonker-Koopman, WEScheij, Svan den Nieuwendijk, AMKoomen, GJvan Loevezijn, ALeemhuis, MWennekes, Tvan der Stelt, Mvan der Marel, GAvan Boeckel, CAAerts, JMOverkleeft, HS Identification and development of biphenyl substituted iminosugars as improved dual glucosylceramide synthase/neutral glucosylceramidase inhibitors. J Med Chem57:9096-104 (2014) 
 
Ceramide glucosyltransferase
Name:Ceramide glucosyltransferase
Type:PROTEIN
Mol. Mass.:44859.25
Organism:Homo sapiens (Human)
Description:ChEMBL_1435474
Residue:394
BDBM50028253
NameBDBM50028253
Synonyms:CHEMBL3354633
TypeSmall organic molecule
Emp. Form.C24H31F2NO5
Mol. Mass.451.5034
SMILESOC[C@H]1[C@@H](O)[C@H](O)[C@@H](O)CN1CCCC(F)(F)COCc1ccc(cc1)-c1ccccc1