Reaction Details
TargetCeramide glucosyltransferase
LigandBDBM50028254
Substrate/Competitorn/a
Meas. Tech.ChEMBL_1435474 (CHEMBL3384689)
IC50 3.0±n/a nM
Citation Ghisaidoobe, ATvan den Berg, RJButt, SSStrijland, ADonker-Koopman, WEScheij, Svan den Nieuwendijk, AMKoomen, GJvan Loevezijn, ALeemhuis, MWennekes, Tvan der Stelt, Mvan der Marel, GAvan Boeckel, CAAerts, JMOverkleeft, HS Identification and development of biphenyl substituted iminosugars as improved dual glucosylceramide synthase/neutral glucosylceramidase inhibitors. J Med Chem57:9096-104 (2014) 
 
Ceramide glucosyltransferase
Name:Ceramide glucosyltransferase
Type:PROTEIN
Mol. Mass.:44859.25
Organism:Homo sapiens (Human)
Description:ChEMBL_1435474
Residue:394
BDBM50028254
NameBDBM50028254
Synonyms:CHEMBL3354634
TypeSmall organic molecule
Emp. Form.C25H32F3NO5
Mol. Mass.483.5205
SMILESOC[C@H]1[C@@H](O)[C@H](O)[C@@H](O)CN1CCCCCOCc1ccc(cc1C(F)(F)F)-c1ccccc1