Reaction Details
TargetLactase/phlorizin hydrolase
LigandBDBM50028255
Substrate/Competitorn/a
Meas. Tech.ChEMBL_1435478 (CHEMBL3384693)
IC50 100000±n/a nM
Citation Ghisaidoobe, ATvan den Berg, RJButt, SSStrijland, ADonker-Koopman, WEScheij, Svan den Nieuwendijk, AMKoomen, GJvan Loevezijn, ALeemhuis, MWennekes, Tvan der Stelt, Mvan der Marel, GAvan Boeckel, CAAerts, JMOverkleeft, HS Identification and development of biphenyl substituted iminosugars as improved dual glucosylceramide synthase/neutral glucosylceramidase inhibitors. J Med Chem57:9096-104 (2014) 
 
Lactase/phlorizin hydrolase
Name:Lactase/phlorizin hydrolase
Type:PROTEIN
Mol. Mass.:218576.40
Organism:Homo sapiens (Human)
Description:ChEMBL_1435478
Residue:1927
BDBM50028255
NameBDBM50028255
Synonyms:CHEMBL3354635
TypeSmall organic molecule
Emp. Form.C25H32F3NO5
Mol. Mass.483.5205
SMILESOC[C@H]1[C@@H](O)[C@H](O)[C@@H](O)CN1CCCCCOCc1ccc(-c2ccccc2)c(c1)C(F)(F)F