Reaction Details
TargetCarbonic anhydrase 1
LigandBDBM50028271
Substrate/Competitorn/a
Meas. Tech.ChEMBL_1436190 (CHEMBL3386552)
Ki 2400±n/a nM
Citation Moeker, JMahon, BPBornaghi, LFVullo, DSupuran, CTMcKenna, RPoulsen, SA Structural insights into carbonic anhydrase IX isoform specificity of carbohydrate-based sulfamates. J Med Chem57:8635-45 (2014) 
 
Carbonic anhydrase 1
Name:Carbonic anhydrase 1
Type:Enzyme
Mol. Mass.:28873.37
Organism:Homo sapiens (Human)
Description:P00915
Residue:261
BDBM50028271
NameBDBM50028271
Synonyms:CHEMBL3342257
TypeSmall organic molecule
Emp. Form.C10H20N2O10S2
Mol. Mass.392.403
SMILESNS(=O)(=O)O[C@@H]1CCN(C1)S(=O)(=O)[C@@H]1O[C@H](CO)[C@@H](O)[C@H](O)[C@H]1O