Reaction Details
TargetCarbonic anhydrase 1
LigandBDBM50028266
Substrate/Competitorn/a
Meas. Tech.ChEMBL_1436190 (CHEMBL3386552)
Ki 1550±n/a nM
Citation Moeker, JMahon, BPBornaghi, LFVullo, DSupuran, CTMcKenna, RPoulsen, SA Structural insights into carbonic anhydrase IX isoform specificity of carbohydrate-based sulfamates. J Med Chem57:8635-45 (2014) 
 
Carbonic anhydrase 1
Name:Carbonic anhydrase 1
Type:Enzyme
Mol. Mass.:28873.37
Organism:Homo sapiens (Human)
Description:P00915
Residue:261
BDBM50028266
NameBDBM50028266
Synonyms:CHEMBL3342251
TypeSmall organic molecule
Emp. Form.C18H28N2O14S2
Mol. Mass.560.55
SMILESCC(=O)OC[C@H]1O[C@H]([C@H](OC(C)=O)[C@@H](OC(C)=O)[C@@H]1OC(C)=O)S(=O)(=O)N1CC[C@H](C1)OS(N)(=O)=O