Reaction Details
TargetCarbonic anhydrase 12
LigandBDBM50028268
Substrate/Competitorn/a
Meas. Tech.ChEMBL_1436193 (CHEMBL3386555)
Ki 9.0±n/a nM
Citation Moeker, JMahon, BPBornaghi, LFVullo, DSupuran, CTMcKenna, RPoulsen, SA Structural insights into carbonic anhydrase IX isoform specificity of carbohydrate-based sulfamates. J Med Chem57:8635-45 (2014) 
 
Carbonic anhydrase 12
Name:Carbonic anhydrase 12
Type:Enzyme
Mol. Mass.:39456.00
Organism:Homo sapiens (Human)
Description:Catalytic domain of human cloned isozyme was used in the assay
Residue:354
BDBM50028268
NameBDBM50028268
Synonyms:CHEMBL3342249
TypeSmall organic molecule
Emp. Form.C20H34N2O14S2
Mol. Mass.590.619
SMILESCC(=O)OC[C@H]1O[C@H]([C@H](OC(C)=O)[C@@H](OC(C)=O)[C@@H]1OC(C)=O)S(=O)(=O)NCCCCCCOS(N)(=O)=O