Reaction Details
TargetC-X-C chemokine receptor type 2
LigandBDBM150969
Substrate/Competitorn/a
Meas. Tech.ChEMBL_1436204 (CHEMBL3386566)
IC50 278±n/a nM
Citation Maeda, DYPeck, AMSchuler, ADQuinn, MTKirpotina, LNWicomb, WNFan, GHZebala, JA Discovery of 2-[5-(4-Fluorophenylcarbamoyl)pyridin-2-ylsulfanylmethyl]phenylboronic Acid (SX-517): Noncompetitive Boronic Acid Antagonist of CXCR1 and CXCR2. J Med Chem57:8378-97 (2014) 
 
C-X-C chemokine receptor type 2
Name:C-X-C chemokine receptor type 2
Type:Protein
Mol. Mass.:40767.88
Organism:Homo sapiens (Human)
Description:P25025
Residue:360
BDBM150969
NameBDBM150969
Synonyms:US8981106, 159 | USRE47267, Compound 159
TypeSmall organic molecule
Emp. Form.C20H16BF3N2O4S
Mol. Mass.448.223
SMILESOB(O)c1ccccc1CSc1ccc(cn1)C(=O)Nc1ccc(OC(F)(F)F)cc1