Reaction Details
TargetC-X-C chemokine receptor type 2
LigandBDBM150837
Substrate/Competitorn/a
Meas. Tech.ChEMBL_1436204 (CHEMBL3386566)
IC50 170±n/a nM
Citation Maeda, DYPeck, AMSchuler, ADQuinn, MTKirpotina, LNWicomb, WNFan, GHZebala, JA Discovery of 2-[5-(4-Fluorophenylcarbamoyl)pyridin-2-ylsulfanylmethyl]phenylboronic Acid (SX-517): Noncompetitive Boronic Acid Antagonist of CXCR1 and CXCR2. J Med Chem57:8378-97 (2014) 
 
C-X-C chemokine receptor type 2
Name:C-X-C chemokine receptor type 2
Type:Protein
Mol. Mass.:40767.88
Organism:Homo sapiens (Human)
Description:P25025
Residue:360
BDBM150837
NameBDBM150837
Synonyms:US8981106, 26 | USRE47267, Compound 26
TypeSmall organic molecule
Emp. Form.C20H15FN6OS
Mol. Mass.406.436
SMILESFc1ccc(NC(=O)c2ccc(SCc3ccccc3-c3nn[nH]n3)nc2)cc1