Reaction Details
TargetC-X-C chemokine receptor type 2
LigandBDBM50028405
Substrate/Competitorn/a
Meas. Tech.ChEMBL_1436204 (CHEMBL3386566)
IC50>5000±n/a nM
Citation Maeda, DYPeck, AMSchuler, ADQuinn, MTKirpotina, LNWicomb, WNFan, GHZebala, JA Discovery of 2-[5-(4-Fluorophenylcarbamoyl)pyridin-2-ylsulfanylmethyl]phenylboronic Acid (SX-517): Noncompetitive Boronic Acid Antagonist of CXCR1 and CXCR2. J Med Chem57:8378-97 (2014) 
 
C-X-C chemokine receptor type 2
Name:C-X-C chemokine receptor type 2
Type:Protein
Mol. Mass.:40767.88
Organism:Homo sapiens (Human)
Description:P25025
Residue:360
BDBM50028405
NameBDBM50028405
Synonyms:CHEMBL3354644
TypeSmall organic molecule
Emp. Form.C16H13FN2O3S
Mol. Mass.332.349
SMILESFc1ccc(NC(=O)c2ccc(SC3CCOC3=O)nc2)cc1