Reaction Details
TargetC-X-C chemokine receptor type 2
LigandBDBM50028406
Substrate/Competitorn/a
Meas. Tech.ChEMBL_1436204 (CHEMBL3386566)
IC50>10000±n/a nM
Citation Maeda, DYPeck, AMSchuler, ADQuinn, MTKirpotina, LNWicomb, WNFan, GHZebala, JA Discovery of 2-[5-(4-Fluorophenylcarbamoyl)pyridin-2-ylsulfanylmethyl]phenylboronic Acid (SX-517): Noncompetitive Boronic Acid Antagonist of CXCR1 and CXCR2. J Med Chem57:8378-97 (2014) 
 
C-X-C chemokine receptor type 2
Name:C-X-C chemokine receptor type 2
Type:Protein
Mol. Mass.:40767.88
Organism:Homo sapiens (Human)
Description:P25025
Residue:360
BDBM50028406
NameBDBM50028406
Synonyms:CHEMBL3342273
TypeSmall organic molecule
Emp. Form.C13H10FN3O3S
Mol. Mass.307.3
SMILES[O-][N+](=O)CSc1ccc(cn1)C(=O)Nc1ccc(F)cc1