Reaction Details
TargetPlatelet-activating factor receptor
LigandBDBM150811
Substrate/Competitorn/a
Meas. Tech.ChEMBL_1436868 (CHEMBL3387790)
IC50>5000±n/a nM
Citation Maeda, DYPeck, AMSchuler, ADQuinn, MTKirpotina, LNWicomb, WNFan, GHZebala, JA Discovery of 2-[5-(4-Fluorophenylcarbamoyl)pyridin-2-ylsulfanylmethyl]phenylboronic Acid (SX-517): Noncompetitive Boronic Acid Antagonist of CXCR1 and CXCR2. J Med Chem57:8378-97 (2014) 
 
Platelet-activating factor receptor
Name:Platelet-activating factor receptor
Type:Enzyme Catalytic Domain
Mol. Mass.:39219.60
Organism:Homo sapiens (Human)
Description:PAF Platelet activating factor PTAFR HUMAN::P25105
Residue:342
BDBM150811
NameBDBM150811
Synonyms:US8981106, 1 (SX-517) | USRE47267, Compound 1
TypeSmall organic molecule
Emp. Form.C19H16BFN2O3S
Mol. Mass.382.216
SMILESOB(O)c1ccccc1CSc1ccc(cn1)C(=O)Nc1ccc(F)cc1