Reaction Details
TargetC5a anaphylatoxin chemotactic receptor 1
LigandBDBM150811
Substrate/Competitorn/a
Meas. Tech.ChEMBL_1436210 (CHEMBL3386572)
IC50>5000±n/a nM
Citation Maeda, DYPeck, AMSchuler, ADQuinn, MTKirpotina, LNWicomb, WNFan, GHZebala, JA Discovery of 2-[5-(4-Fluorophenylcarbamoyl)pyridin-2-ylsulfanylmethyl]phenylboronic Acid (SX-517): Noncompetitive Boronic Acid Antagonist of CXCR1 and CXCR2. J Med Chem57:8378-97 (2014) 
 
C5a anaphylatoxin chemotactic receptor 1
Name:C5a anaphylatoxin chemotactic receptor 1
Type:Enzyme
Mol. Mass.:39347.68
Organism:Homo sapiens (Human)
Description:P21730
Residue:350
BDBM150811
NameBDBM150811
Synonyms:US8981106, 1 (SX-517) | USRE47267, Compound 1
TypeSmall organic molecule
Emp. Form.C19H16BFN2O3S
Mol. Mass.382.216
SMILESOB(O)c1ccccc1CSc1ccc(cn1)C(=O)Nc1ccc(F)cc1