Reaction Details
TargetNeuraminidase
LigandBDBM50028523
Substrate/Competitorn/a
Meas. Tech.ChEMBL_1437608 (CHEMBL3390210)
IC50 14±n/a nM
Citation Xie, YXu, DHuang, BMa, XQi, WShi, FLiu, XZhang, YXu, W Discovery of N-substituted oseltamivir derivatives as potent and selective inhibitors of H5N1 influenza neuraminidase. J Med Chem57:8445-58 (2014) 
 
Neuraminidase
Name:Neuraminidase
Type:PROTEIN
Mol. Mass.:51863.92
Organism:Influenza A virus (strain A/USSR/90/1977 H1N1)
Description:ChEMBL_109720
Residue:470
BDBM50028523
NameBDBM50028523
Synonyms:CHEMBL3342485
TypeSmall organic molecule
Emp. Form.C25H32N2O4S
Mol. Mass.456.598
SMILESCCC(CC)O[C@@H]1C=C(C[C@H](NCc2ccc(cc2)-c2cccs2)[C@H]1NC(C)=O)C(O)=O