Reaction Details
TargetCarbonic anhydrase 12
LigandBDBM50028568
Substrate/Competitorn/a
Meas. Tech.ChEMBL_1438349 (CHEMBL3382412)
Ki 5.6±n/a nM
Citation Ghorab, MMCeruso, MAlsaid, MSNissan, YMArafa, RKSupuran, CT Novel sulfonamides bearing pyrrole and pyrrolopyrimidine moieties as carbonic anhydrase inhibitors: Synthesis, cytotoxic activity and molecular modeling. Eur J Med Chem87:186-96 (2014) 
 
Carbonic anhydrase 12
Name:Carbonic anhydrase 12
Type:Enzyme
Mol. Mass.:39456.00
Organism:Homo sapiens (Human)
Description:Catalytic domain of human cloned isozyme was used in the assay
Residue:354
BDBM50028568
NameBDBM50028568
Synonyms:CHEMBL3342487
TypeSmall organic molecule
Emp. Form.C25H20BrN5O3S2
Mol. Mass.582.492
SMILESCOc1ccc(NC(=S)Nc2c(C#N)c(cn2-c2ccc(cc2)S(N)(=O)=O)-c2ccc(Br)cc2)cc1