Reaction Details
TargetCarbonic anhydrase 12
LigandBDBM50028552
Substrate/Competitorn/a
Meas. Tech.ChEMBL_1438349 (CHEMBL3382412)
Ki 0.810000±n/a nM
Citation Ghorab, MMCeruso, MAlsaid, MSNissan, YMArafa, RKSupuran, CT Novel sulfonamides bearing pyrrole and pyrrolopyrimidine moieties as carbonic anhydrase inhibitors: Synthesis, cytotoxic activity and molecular modeling. Eur J Med Chem87:186-96 (2014) 
 
Carbonic anhydrase 12
Name:Carbonic anhydrase 12
Type:Enzyme
Mol. Mass.:39456.00
Organism:Homo sapiens (Human)
Description:Catalytic domain of human cloned isozyme was used in the assay
Residue:354
BDBM50028552
NameBDBM50028552
Synonyms:CHEMBL3342491
TypeSmall organic molecule
Emp. Form.C24H17BrIN5O2S2
Mol. Mass.678.363
SMILESNS(=O)(=O)c1ccc(cc1)-n1cc(c(C#N)c1NC(=S)Nc1ccc(I)cc1)-c1ccc(Br)cc1