Reaction Details
TargetCarbonic anhydrase 12
LigandBDBM50028555
Substrate/Competitorn/a
Meas. Tech.ChEMBL_1438349 (CHEMBL3382412)
Ki 0.680000±n/a nM
Citation Ghorab, MMCeruso, MAlsaid, MSNissan, YMArafa, RKSupuran, CT Novel sulfonamides bearing pyrrole and pyrrolopyrimidine moieties as carbonic anhydrase inhibitors: Synthesis, cytotoxic activity and molecular modeling. Eur J Med Chem87:186-96 (2014) 
 
Carbonic anhydrase 12
Name:Carbonic anhydrase 12
Type:Enzyme
Mol. Mass.:39456.00
Organism:Homo sapiens (Human)
Description:Catalytic domain of human cloned isozyme was used in the assay
Residue:354
BDBM50028555
NameBDBM50028555
Synonyms:CHEMBL3342494
TypeSmall organic molecule
Emp. Form.C23H17BrN4O4S2
Mol. Mass.557.439
SMILESNS(=O)(=O)c1ccc(cc1)-n1cc(c(C#N)c1NS(=O)(=O)c1ccccc1)-c1ccc(Br)cc1