Reaction Details
TargetCarbonic anhydrase 12
LigandBDBM50028561
Substrate/Competitorn/a
Meas. Tech.ChEMBL_1438349 (CHEMBL3382412)
Ki 9.1±n/a nM
Citation Ghorab, MMCeruso, MAlsaid, MSNissan, YMArafa, RKSupuran, CT Novel sulfonamides bearing pyrrole and pyrrolopyrimidine moieties as carbonic anhydrase inhibitors: Synthesis, cytotoxic activity and molecular modeling. Eur J Med Chem87:186-96 (2014) 
 
Carbonic anhydrase 12
Name:Carbonic anhydrase 12
Type:Enzyme
Mol. Mass.:39456.00
Organism:Homo sapiens (Human)
Description:Catalytic domain of human cloned isozyme was used in the assay
Residue:354
BDBM50028561
NameBDBM50028561
Synonyms:CHEMBL3342500
TypeSmall organic molecule
Emp. Form.C19H15BrN4O2S2
Mol. Mass.475.382
SMILESCc1nc(S)c2c(cn(-c3ccc(cc3)S(N)(=O)=O)c2n1)-c1ccc(Br)cc1