Reaction Details
TargetCarbonic anhydrase 1
LigandBDBM50028558
Substrate/Competitorn/a
Meas. Tech.ChEMBL_1438346 (CHEMBL3382409)
Ki 235±n/a nM
Citation Ghorab, MMCeruso, MAlsaid, MSNissan, YMArafa, RKSupuran, CT Novel sulfonamides bearing pyrrole and pyrrolopyrimidine moieties as carbonic anhydrase inhibitors: Synthesis, cytotoxic activity and molecular modeling. Eur J Med Chem87:186-96 (2014) 
 
Carbonic anhydrase 1
Name:Carbonic anhydrase 1
Type:Enzyme
Mol. Mass.:28873.37
Organism:Homo sapiens (Human)
Description:P00915
Residue:261
BDBM50028558
NameBDBM50028558
Synonyms:CHEMBL3342497
TypeSmall organic molecule
Emp. Form.C18H14BrN5O2S2
Mol. Mass.476.37
SMILESNc1nc(=S)[nH]c2n(cc(-c3ccc(Br)cc3)c12)-c1ccc(cc1)S(N)(=O)=O