Reaction Details
TargetCarbonic anhydrase 1
LigandBDBM50028553
Substrate/Competitorn/a
Meas. Tech.ChEMBL_1438346 (CHEMBL3382409)
Ki 283±n/a nM
Citation Ghorab, MMCeruso, MAlsaid, MSNissan, YMArafa, RKSupuran, CT Novel sulfonamides bearing pyrrole and pyrrolopyrimidine moieties as carbonic anhydrase inhibitors: Synthesis, cytotoxic activity and molecular modeling. Eur J Med Chem87:186-96 (2014) 
 
Carbonic anhydrase 1
Name:Carbonic anhydrase 1
Type:Enzyme
Mol. Mass.:28873.37
Organism:Homo sapiens (Human)
Description:P00915
Residue:261
BDBM50028553
NameBDBM50028553
Synonyms:CHEMBL3342492
TypeSmall organic molecule
Emp. Form.C24H19BrN6O4S3
Mol. Mass.631.544
SMILESNS(=O)(=O)c1ccc(NC(=S)Nc2c(C#N)c(cn2-c2ccc(cc2)S(N)(=O)=O)-c2ccc(Br)cc2)cc1