Reaction Details
TargetCarbonic anhydrase 1
LigandBDBM50028543
Substrate/Competitorn/a
Meas. Tech.ChEMBL_1438346 (CHEMBL3382409)
Ki 414±n/a nM
Citation Ghorab, MMCeruso, MAlsaid, MSNissan, YMArafa, RKSupuran, CT Novel sulfonamides bearing pyrrole and pyrrolopyrimidine moieties as carbonic anhydrase inhibitors: Synthesis, cytotoxic activity and molecular modeling. Eur J Med Chem87:186-96 (2014) 
 
Carbonic anhydrase 1
Name:Carbonic anhydrase 1
Type:Enzyme
Mol. Mass.:28873.37
Organism:Homo sapiens (Human)
Description:P00915
Residue:261
BDBM50028543
NameBDBM50028543
Synonyms:CHEMBL3342489
TypeSmall organic molecule
Emp. Form.C24H17BrN6O4S2
Mol. Mass.597.464
SMILESNS(=O)(=O)c1ccc(cc1)-n1cc(c(C#N)c1NC(=S)Nc1ccc(cc1)[N+]([O-])=O)-c1ccc(Br)cc1