Reaction Details
TargetCarbonic anhydrase 2
LigandBDBM50028562
Substrate/Competitorn/a
Meas. Tech.ChEMBL_1438347 (CHEMBL3382410)
Ki 5.2±n/a nM
Citation Ghorab, MMCeruso, MAlsaid, MSNissan, YMArafa, RKSupuran, CT Novel sulfonamides bearing pyrrole and pyrrolopyrimidine moieties as carbonic anhydrase inhibitors: Synthesis, cytotoxic activity and molecular modeling. Eur J Med Chem87:186-96 (2014) 
 
Carbonic anhydrase 2
Name:Carbonic anhydrase 2
Type:Enzyme
Mol. Mass.:29250.71
Organism:Homo sapiens (Human)
Description:P00918
Residue:260
BDBM50028562
NameBDBM50028562
Synonyms:CHEMBL3342501
TypeSmall organic molecule
Emp. Form.C21H17BrN4O4S
Mol. Mass.501.353
SMILESCC(=O)CC(=O)Nc1c(C#N)c(cn1-c1ccc(cc1)S(N)(=O)=O)-c1ccc(Br)cc1