Reaction Details
TargetAcetylcholinesterase
LigandBDBM50028681
Substrate/Competitorn/a
Meas. Tech.ChEMBL_1439857 (CHEMBL3387411)
IC50 1.9±n/a nM
Citation Nepovimova, EUliassi, EKorabecny, JPeña-Altamira, LESamez, SPesaresi, AGarcia, GEBartolini, MAndrisano, VBergamini, CFato, RLamba, DRoberti, MKuca, KMonti, BBolognesi, ML Multitarget drug design strategy: quinone-tacrine hybrids designed to block amyloid-ß aggregation and to exert anticholinesterase and antioxidant effects. J Med Chem57:8576-89 (2014) 
 
Acetylcholinesterase
Name:Acetylcholinesterase
Type:Enzyme
Mol. Mass.:67792.70
Organism:Homo sapiens (Human)
Description:P22303
Residue:614
BDBM50028681
NameBDBM50028681
Synonyms:CHEMBL3356532
TypeSmall organic molecule
Emp. Form.C25H22ClN3O2
Mol. Mass.431.914
SMILESClc1ccc2c(NCCNC3=CC(=O)c4ccccc4C3=O)c3CCCCc3nc2c1