Reaction Details
TargetCholinesterase
LigandBDBM8961
Substrate/Competitorn/a
Meas. Tech.ChEMBL_1439858 (CHEMBL3387412)
IC50 23±n/a nM
Citation Nepovimova, EUliassi, EKorabecny, JPeña-Altamira, LESamez, SPesaresi, AGarcia, GEBartolini, MAndrisano, VBergamini, CFato, RLamba, DRoberti, MKuca, KMonti, BBolognesi, ML Multitarget drug design strategy: quinone-tacrine hybrids designed to block amyloid-ß aggregation and to exert anticholinesterase and antioxidant effects. J Med Chem57:8576-89 (2014) 
 
Cholinesterase
Name:Cholinesterase
Type:Homotetramer
Mol. Mass.:68422.27
Organism:Homo sapiens (Human)
Description:P06276
Residue:602
BDBM8961
NameBDBM8961
Synonyms:1,2,3,4-tetrahydro-9-acridinamine 9-THA CHEMBL1337960 Cognex Tracine cid_1935 | tacrine.HCl
TypeSmall organic molecule
Emp. Form.C13H14N2
Mol. Mass.198.2637
SMILESNc1c2CCCCc2nc2ccccc12