Reaction Details
TargetC3a anaphylatoxin chemotactic receptor
LigandBDBM50028697
Substrate/Competitorn/a
Meas. Tech.ChEMBL_1439872 (CHEMBL3387987)
IC50 31±n/a nM
Citation Reid, RCYau, MKSingh, RHamidon, JKLim, JStoermer, MJFairlie, DP Potent heterocyclic ligands for human complement c3a receptor. J Med Chem57:8459-70 (2014) 
 
C3a anaphylatoxin chemotactic receptor
Name:C3a anaphylatoxin chemotactic receptor
Type:PROTEIN
Mol. Mass.:53864.66
Organism:Homo sapiens (Human)
Description:ChEMBL_642034
Residue:482
BDBM50028697
NameBDBM50028697
Synonyms:CHEMBL3342690
TypeSmall organic molecule
Emp. Form.C25H30N6O3
Mol. Mass.462.5441
SMILESCc1c(nc(C(c2ccccc2)c2ccccc2)n1C)C(=O)N[C@@H](CCCNC(N)=N)C(O)=O