Reaction Details
TargetC3a anaphylatoxin chemotactic receptor
LigandBDBM50028696
Substrate/Competitorn/a
Meas. Tech.ChEMBL_1439874 (CHEMBL3387989)
EC50 25±n/a nM
Citation Reid, RCYau, MKSingh, RHamidon, JKLim, JStoermer, MJFairlie, DP Potent heterocyclic ligands for human complement c3a receptor. J Med Chem57:8459-70 (2014) 
 
C3a anaphylatoxin chemotactic receptor
Name:C3a anaphylatoxin chemotactic receptor
Type:PROTEIN
Mol. Mass.:53864.66
Organism:Homo sapiens (Human)
Description:ChEMBL_642034
Residue:482
BDBM50028696
NameBDBM50028696
Synonyms:CHEMBL3342689
TypeSmall organic molecule
Emp. Form.C24H28N6O3
Mol. Mass.448.5175
SMILESCc1[nH]c(nc1C(=O)N[C@@H](CCCNC(N)=N)C(O)=O)C(c1ccccc1)c1ccccc1