Reaction Details
TargetC3a anaphylatoxin chemotactic receptor
LigandBDBM50322650
Substrate/Competitorn/a
Meas. Tech.ChEMBL_1439872 (CHEMBL3387987)
IC50 10.0±n/a nM
Citation Reid, RCYau, MKSingh, RHamidon, JKLim, JStoermer, MJFairlie, DP Potent heterocyclic ligands for human complement c3a receptor. J Med Chem57:8459-70 (2014) 
 
C3a anaphylatoxin chemotactic receptor
Name:C3a anaphylatoxin chemotactic receptor
Type:PROTEIN
Mol. Mass.:53864.66
Organism:Homo sapiens (Human)
Description:ChEMBL_642034
Residue:482
BDBM50322650
NameBDBM50322650
Synonyms:(S)-2-(2-(2,2-diphenylethoxy)acetamido)-5-guanidinopentanoic acid N2-[(2,2-diphenylethoxy)acetyl]-L-arginine | SB-290157
TypeSmall organic molecule
Emp. Form.C22H28N4O4
Mol. Mass.412.4821
SMILES[#7]\[#6](-[#7])=[#7]\[#6]-[#6]-[#6]-[#6@H](-[#7]-[#6](=O)-[#6]-[#8]-[#6]-[#6](-c1ccccc1)-c1ccccc1)-[#6](-[#8])=O