Reaction Details
TargetProstaglandin E synthase
LigandBDBM50028856
Substrate/Competitorn/a
Meas. Tech.ChEMBL_1439893 (CHEMBL3388593)
IC50 1.2±n/a nM
Citation Banerjee, APawar, MYPatil, SYadav, PSKadam, PAKattige, VGDeshpande, DSPednekar, PVPisat, MKGharat, LA Development of 2-aryl substituted quinazolin-4(3H)-one, pyrido[4,3-d]pyrimidin-4(3H)-one and pyrido[2,3-d]pyrimidin-4(3H)-one derivatives as microsomal prostaglandin E(2) synthase-1 inhibitors. Bioorg Med Chem Lett24:4838-44 (2014) 
 
Prostaglandin E synthase
Name:Prostaglandin E synthase
Type:Protein
Mol. Mass.:17112.22
Organism:Homo sapiens (Human)
Description:n/a
Residue:152
BDBM50028856
NameBDBM50028856
Synonyms:CHEMBL3342696 US9732066, 113
TypeSmall organic molecule
Emp. Form.C25H19Cl2F3N4O3
Mol. Mass.551.345
SMILESCOCc1nc2c(cc(NC(=O)c3c(Cl)cccc3C(F)(F)F)cc2[nH]1)C(=O)Nc1cccc(Cl)c1C