Reaction Details
TargetProstaglandin E synthase
LigandBDBM50028854
Substrate/Competitorn/a
Meas. Tech.ChEMBL_1439889 (CHEMBL3388004)
IC50 12±n/a nM
Citation Banerjee, APawar, MYPatil, SYadav, PSKadam, PAKattige, VGDeshpande, DSPednekar, PVPisat, MKGharat, LA Development of 2-aryl substituted quinazolin-4(3H)-one, pyrido[4,3-d]pyrimidin-4(3H)-one and pyrido[2,3-d]pyrimidin-4(3H)-one derivatives as microsomal prostaglandin E(2) synthase-1 inhibitors. Bioorg Med Chem Lett24:4838-44 (2014) 
 
Prostaglandin E synthase
Name:Prostaglandin E synthase
Type:Protein
Mol. Mass.:17112.22
Organism:Homo sapiens (Human)
Description:n/a
Residue:152
BDBM50028854
NameBDBM50028854
Synonyms:CHEMBL3342693
TypeSmall organic molecule
Emp. Form.C23H22F5N5O2
Mol. Mass.495.4451
SMILESCC(C)C(=O)NCc1cnc(C(F)F)c(c1)C(=O)Nc1nc(C)c([nH]1)-c1ccc(cc1)C(F)(F)F