Reaction Details
TargetHigh affinity cAMP-specific 3',5'-cyclic phosphodiesterase 7A
LigandBDBM50028925
Substrate/Competitorn/a
Meas. Tech.ChEMBL_1432320 (CHEMBL3383864)
IC50 990±n/a nM
Citation García, AMBrea, JMorales-García, JAPerez, DIGonzález, AAlonso-Gil, SGracia-Rubio, IRos-Simó, CConde, SCadavid, MILoza, MIPerez-Castillo, AValverde, OMartinez, AGil, C Modulation of cAMP-specific PDE without emetogenic activity: new sulfide-like PDE7 inhibitors. J Med Chem57:8590-607 (2014) 
 
High affinity cAMP-specific 3',5'-cyclic phosphodiesterase 7A
Name:High affinity cAMP-specific 3',5'-cyclic phosphodiesterase 7A
Type:Enzyme
Mol. Mass.:55514.96
Organism:Homo sapiens (Human)
Description:Q13946
Residue:482
BDBM50028925
NameBDBM50028925
Synonyms:CHEMBL3359111
TypeSmall organic molecule
Emp. Form.C12H7BrClNO2S
Mol. Mass.344.611
SMILES[O-][N+](=O)c1cc(Cl)ccc1Sc1ccccc1Br