Reaction Details
TargetMatrix metalloproteinase-9
LigandBDBM27878
Substrate/Competitorn/a
Meas. Tech.ChEMBL_1433221 (CHEMBL3388188)
IC50>2500±n/a nM
Citation Fabre, BRamos, Ade Pascual-Teresa, B Targeting matrix metalloproteinases: exploring the dynamics of the s1' pocket in the design of selective, small molecule inhibitors. J Med Chem57:10205-19 (2014) 
 
Matrix metalloproteinase-9
Name:Matrix metalloproteinase-9
Type:Enzyme
Mol. Mass.:78452.28
Organism:Homo sapiens (Human)
Description:P14780
Residue:707
BDBM27878
NameBDBM27878
Synonyms:13-(carbamoylmethyl)-3-oxo-N-[(3-oxo-3,4-dihydro-2H-1,4-benzoxazin-6-yl)methyl]-8-thia-4,6-diazatricyclo[7.4.0.0^{2,7}]trideca-1(9),2(7),5-triene-5-carboxamide hexahydrobenzothienopyrimidine, 2
TypeSmall organic molecule
Emp. Form.C22H21N5O5S
Mol. Mass.467.498
SMILESNC(=O)CC1CCCc2sc3nc([nH]c(=O)c3c12)C(=O)NCc1ccc2OCC(=O)Nc2c1