Reaction Details
TargetInterstitial collagenase
LigandBDBM50028943
Substrate/Competitorn/a
Meas. Tech.ChEMBL_1432368 (CHEMBL3384473)
IC50 40±n/a nM
Citation Fabre, BRamos, Ade Pascual-Teresa, B Targeting matrix metalloproteinases: exploring the dynamics of the s1' pocket in the design of selective, small molecule inhibitors. J Med Chem57:10205-19 (2014) 
 
Interstitial collagenase
Name:Interstitial collagenase
Type:Enzyme
Mol. Mass.:54010.26
Organism:Homo sapiens (Human)
Description: P03956
Residue:469
BDBM50028943
NameBDBM50028943
Synonyms:CHEMBL3359656
TypeSmall organic molecule
Emp. Form.C21H24N2O6S
Mol. Mass.432.49
SMILESCC#CCOc1ccc(Oc2ccc(cc2)S(=O)(=O)NC(C(C)C)C(=O)NO)cc1