Reaction Details
TargetNeutrophil collagenase
LigandBDBM50028939
Substrate/Competitorn/a
Meas. Tech.ChEMBL_1432370 (CHEMBL3384475)
IC50 1700±n/a nM
Citation Fabre, BRamos, Ade Pascual-Teresa, B Targeting matrix metalloproteinases: exploring the dynamics of the s1' pocket in the design of selective, small molecule inhibitors. J Med Chem57:10205-19 (2014) 
 
Neutrophil collagenase
Name:Neutrophil collagenase
Type:Enzyme
Mol. Mass.:53413.48
Organism:Homo sapiens (Human)
Description:P22894
Residue:467
BDBM50028939
NameBDBM50028939
Synonyms:CHEMBL1231240
TypeSmall organic molecule
Emp. Form.C17H21N3O4
Mol. Mass.331.3663
SMILESOCCC1CCN(CC1)[C@@]1(C(=O)NC(O)=NC1=O)c1ccccc1