Reaction Details
TargetGamma-butyrobetaine dioxygenase
LigandBDBM50028972
Substrate/Competitorn/a
Meas. Tech.ChEMBL_1434106 (CHEMBL3382784)
IC50 6300±n/a nM
Citation Rydzik, AMBrem, JStruwe, WBKochan, GTBenesch, JLSchofield, CJ Ejection of structural zinc leads to inhibition of¿-butyrobetaine hydroxylase. Bioorg Med Chem Lett24:4954-7 (2014) 
 
Gamma-butyrobetaine dioxygenase
Name:Gamma-butyrobetaine dioxygenase
Type:PROTEIN
Mol. Mass.:44715.93
Organism:Homo sapiens (Human)
Description:ChEMBL_1434107
Residue:387
BDBM50028972
NameBDBM50028972
Synonyms:Benzene Selenoic Acid
TypeSmall organic molecule
Emp. Form.C6H6O2Se
Mol. Mass.189.07
SMILESO[Se](=O)c1ccccc1