Reaction Details
TargetGamma-butyrobetaine dioxygenase
LigandBDBM43362
Substrate/Competitorn/a
Meas. Tech.ChEMBL_1434105 (CHEMBL3382783)
IC50 34000±n/a nM
Citation Rydzik, AMBrem, JStruwe, WBKochan, GTBenesch, JLSchofield, CJ Ejection of structural zinc leads to inhibition of¿-butyrobetaine hydroxylase. Bioorg Med Chem Lett24:4954-7 (2014) 
 
Gamma-butyrobetaine dioxygenase
Name:Gamma-butyrobetaine dioxygenase
Type:PROTEIN
Mol. Mass.:44715.93
Organism:Homo sapiens (Human)
Description:ChEMBL_1434107
Residue:387
BDBM43362
NameBDBM43362
Synonyms:MLS000069752 N,N-dimethylcarbamodithioic acid [[dimethylamino(sulfanylidene)methyl]thio] ester TETRAMETHYLTHIURAM DISULFIDE dimethylcarbamothioylsulfanyl N,N-dimethylcarbamodithioate
TypeSmall organic molecule
Emp. Form.C6H12N2S4
Mol. Mass.240.433
SMILESCN(C)C(=S)SSC(=S)N(C)C