Reaction Details
TargetGamma-butyrobetaine dioxygenase
LigandBDBM50028969
Substrate/Competitorn/a
Meas. Tech.ChEMBL_1434105 (CHEMBL3382783)
IC50 47000±n/a nM
Citation Rydzik, AMBrem, JStruwe, WBKochan, GTBenesch, JLSchofield, CJ Ejection of structural zinc leads to inhibition of¿-butyrobetaine hydroxylase. Bioorg Med Chem Lett24:4954-7 (2014) 
 
Gamma-butyrobetaine dioxygenase
Name:Gamma-butyrobetaine dioxygenase
Type:PROTEIN
Mol. Mass.:44715.93
Organism:Homo sapiens (Human)
Description:ChEMBL_1434107
Residue:387
BDBM50028969
NameBDBM50028969
Synonyms:CHEMBL3122204
TypeSmall organic molecule
Emp. Form.C12H10Se2
Mol. Mass.312.13
SMILES[Se]([Se]c1ccccc1)c1ccccc1