Reaction Details
TargetGamma-butyrobetaine dioxygenase
LigandBDBM34233
Substrate/Competitorn/a
Meas. Tech.ChEMBL_1434108 (CHEMBL3382786)
IC50 720±n/a nM
Citation Rydzik, AMBrem, JStruwe, WBKochan, GTBenesch, JLSchofield, CJ Ejection of structural zinc leads to inhibition of¿-butyrobetaine hydroxylase. Bioorg Med Chem Lett24:4954-7 (2014) 
 
Gamma-butyrobetaine dioxygenase
Name:Gamma-butyrobetaine dioxygenase
Type:PROTEIN
Mol. Mass.:44715.93
Organism:Homo sapiens (Human)
Description:ChEMBL_1434107
Residue:387
BDBM34233
NameBDBM34233
Synonyms:2-Phenyl-benzo[d]isoselenazol-3-one 2-phenyl-1,2-benzisoselazol-3(2H)-one 2-phenylbenzo[d][1,2]selenazol-3(2H)-one EBSELEN MLS000028488 cid_3194 | med.21724, Compound 153
TypeSmall organic molecule
Emp. Form.C13H9NOSe
Mol. Mass.274.18
SMILESO=c1n([se]c2ccccc12)-c1ccccc1