Reaction Details
TargetGamma-butyrobetaine dioxygenase
LigandBDBM50028971
Substrate/Competitorn/a
Meas. Tech.ChEMBL_1434108 (CHEMBL3382786)
IC50 2300±n/a nM
Citation Rydzik, AMBrem, JStruwe, WBKochan, GTBenesch, JLSchofield, CJ Ejection of structural zinc leads to inhibition of¿-butyrobetaine hydroxylase. Bioorg Med Chem Lett24:4954-7 (2014) 
 
Gamma-butyrobetaine dioxygenase
Name:Gamma-butyrobetaine dioxygenase
Type:PROTEIN
Mol. Mass.:44715.93
Organism:Homo sapiens (Human)
Description:ChEMBL_1434107
Residue:387
BDBM50028971
NameBDBM50028971
Synonyms:CHEMBL3335713
TypeSmall organic molecule
Emp. Form.C6H5BrSe
Mol. Mass.235.97
SMILESBr[Se]c1ccccc1