Reaction Details
TargetGamma-butyrobetaine dioxygenase
LigandBDBM50028967
Substrate/Competitorn/a
Meas. Tech.ChEMBL_1434107 (CHEMBL3382785)
IC50 19000±n/a nM
Citation Rydzik, AMBrem, JStruwe, WBKochan, GTBenesch, JLSchofield, CJ Ejection of structural zinc leads to inhibition of¿-butyrobetaine hydroxylase. Bioorg Med Chem Lett24:4954-7 (2014) 
 
Gamma-butyrobetaine dioxygenase
Name:Gamma-butyrobetaine dioxygenase
Type:PROTEIN
Mol. Mass.:44715.93
Organism:Homo sapiens (Human)
Description:ChEMBL_1434107
Residue:387
BDBM50028967
NameBDBM50028967
Synonyms:CHEMBL3335714
TypeSmall organic molecule
Emp. Form.C6H6OSe
Mol. Mass.173.07
SMILESO[Se]c1ccccc1