Reaction Details
TargetOrexin receptor type 2
LigandBDBM50029048
Substrate/Competitorn/a
Meas. Tech.ChEMBL_1434836 (CHEMBL3384633)
Ki 36±n/a nM
Citation Yoshida, YTerauchi, TNaoe, YKazuta, YOzaki, FBeuckmann, CTNakagawa, MSuzuki, MKushida, ITakenaka, OUeno, TYonaga, M Design, synthesis, and structure-activity relationships of a series of novel N-aryl-2-phenylcyclopropanecarboxamide that are potent and orally active orexin receptor antagonists. Bioorg Med Chem22:6071-88 (2014) 
 
Orexin receptor type 2
Name:Orexin receptor type 2
Type:Protein
Mol. Mass.:50710.53
Organism:Homo sapiens (Human)
Description:O43614
Residue:444
BDBM50029048
NameBDBM50029048
Synonyms:CHEMBL3343246
TypeSmall organic molecule
Emp. Form.C24H24N2O4
Mol. Mass.404.4584
SMILESCOc1ccc(OC[C@]2(C[C@H]2C(=O)Nc2ccccn2)c2ccccc2)cc1OC