Reaction Details
TargetOrexin receptor type 2
LigandBDBM50029062
Substrate/Competitorn/a
Meas. Tech.ChEMBL_1434836 (CHEMBL3384633)
Ki 27±n/a nM
Citation Yoshida, YTerauchi, TNaoe, YKazuta, YOzaki, FBeuckmann, CTNakagawa, MSuzuki, MKushida, ITakenaka, OUeno, TYonaga, M Design, synthesis, and structure-activity relationships of a series of novel N-aryl-2-phenylcyclopropanecarboxamide that are potent and orally active orexin receptor antagonists. Bioorg Med Chem22:6071-88 (2014) 
 
Orexin receptor type 2
Name:Orexin receptor type 2
Type:Protein
Mol. Mass.:50710.53
Organism:Homo sapiens (Human)
Description:O43614
Residue:444
BDBM50029062
NameBDBM50029062
Synonyms:CHEMBL3343257
TypeSmall organic molecule
Emp. Form.C26H23FN2O4
Mol. Mass.446.4702
SMILESCOc1ccc(OC[C@]2(C[C@H]2C(=O)c2nc3cc(F)ccc3[nH]2)c2ccccc2)cc1OC