Reaction Details
TargetCarbonic anhydrase 1
LigandBDBM50029071
Substrate/Competitorn/a
Meas. Tech.ChEMBL_1435512 (CHEMBL3385332)
Ki 248±n/a nM
Citation Sarikaya, BCeruso, MCarta, FSupuran, CT Inhibition of carbonic anhydrase isoforms I, II, IX and XII with novel Schiff bases: identification of selective inhibitors for the tumor-associated isoforms over the cytosolic ones. Bioorg Med Chem22:5883-90 (2014) 
 
Carbonic anhydrase 1
Name:Carbonic anhydrase 1
Type:Enzyme
Mol. Mass.:28873.37
Organism:Homo sapiens (Human)
Description:P00915
Residue:261
BDBM50029071
NameBDBM50029071
Synonyms:CHEMBL3343265
TypeSmall organic molecule
Emp. Form.C11H9FN2O3S
Mol. Mass.268.264
SMILESNS(=O)(=O)c1ccc(\N=C\c2ccco2)c(F)c1