Reaction Details
TargetCarbonic anhydrase 1
LigandBDBM50029075
Substrate/Competitorn/a
Meas. Tech.ChEMBL_1435512 (CHEMBL3385332)
Ki 5335±n/a nM
Citation Sarikaya, BCeruso, MCarta, FSupuran, CT Inhibition of carbonic anhydrase isoforms I, II, IX and XII with novel Schiff bases: identification of selective inhibitors for the tumor-associated isoforms over the cytosolic ones. Bioorg Med Chem22:5883-90 (2014) 
 
Carbonic anhydrase 1
Name:Carbonic anhydrase 1
Type:Enzyme
Mol. Mass.:28873.37
Organism:Homo sapiens (Human)
Description:P00915
Residue:261
BDBM50029075
NameBDBM50029075
Synonyms:CHEMBL3343269
TypeSmall organic molecule
Emp. Form.C15H15BrN2O3S
Mol. Mass.383.26
SMILESNS(=O)(=O)c1ccc(CC\N=C\c2cccc(Br)c2O)cc1