Reaction Details
TargetCarbonic anhydrase 1
LigandBDBM50029080
Substrate/Competitorn/a
Meas. Tech.ChEMBL_1435512 (CHEMBL3385332)
Ki 2940±n/a nM
Citation Sarikaya, BCeruso, MCarta, FSupuran, CT Inhibition of carbonic anhydrase isoforms I, II, IX and XII with novel Schiff bases: identification of selective inhibitors for the tumor-associated isoforms over the cytosolic ones. Bioorg Med Chem22:5883-90 (2014) 
 
Carbonic anhydrase 1
Name:Carbonic anhydrase 1
Type:Enzyme
Mol. Mass.:28873.37
Organism:Homo sapiens (Human)
Description:P00915
Residue:261
BDBM50029080
NameBDBM50029080
Synonyms:CHEMBL3343274
TypeSmall organic molecule
Emp. Form.C16H18N2O2S2
Mol. Mass.334.456
SMILESCSc1ccc(\C=N\CCc2ccc(cc2)S(N)(=O)=O)cc1