Reaction Details
TargetCarbonic anhydrase 9
LigandBDBM50029084
Substrate/Competitorn/a
Meas. Tech.ChEMBL_1435514 (CHEMBL3385334)
Ki 193±n/a nM
Citation Sarikaya, BCeruso, MCarta, FSupuran, CT Inhibition of carbonic anhydrase isoforms I, II, IX and XII with novel Schiff bases: identification of selective inhibitors for the tumor-associated isoforms over the cytosolic ones. Bioorg Med Chem22:5883-90 (2014) 
 
Carbonic anhydrase 9
Name:Carbonic anhydrase 9
Type:Enzyme
Mol. Mass.:49669.03
Organism:Homo sapiens (Human)
Description:Catalytic domain of human cloned isozyme was used in the assay
Residue:459
BDBM50029084
NameBDBM50029084
Synonyms:CHEMBL3343268
TypeSmall organic molecule
Emp. Form.C13H13N2NaO6S2
Mol. Mass.380.372
SMILES[Na+].NS(=O)(=O)c1ccc(CC\N=C\c2ccc(o2)S([O-])(=O)=O)cc1