Reaction Details
TargetCarbonic anhydrase 12
LigandBDBM50029070
Substrate/Competitorn/a
Meas. Tech.ChEMBL_1435515 (CHEMBL3385335)
Ki 58±n/a nM
Citation Sarikaya, BCeruso, MCarta, FSupuran, CT Inhibition of carbonic anhydrase isoforms I, II, IX and XII with novel Schiff bases: identification of selective inhibitors for the tumor-associated isoforms over the cytosolic ones. Bioorg Med Chem22:5883-90 (2014) 
 
Carbonic anhydrase 12
Name:Carbonic anhydrase 12
Type:Enzyme
Mol. Mass.:39456.00
Organism:Homo sapiens (Human)
Description:Catalytic domain of human cloned isozyme was used in the assay
Residue:354
BDBM50029070
NameBDBM50029070
Synonyms:CHEMBL3343264
TypeSmall organic molecule
Emp. Form.C13H11FN2O2S
Mol. Mass.278.302
SMILESNS(=O)(=O)c1ccc(\N=C\c2ccccc2)c(F)c1