Reaction Details
TargetCarbonic anhydrase 12
LigandBDBM50029076
Substrate/Competitorn/a
Meas. Tech.ChEMBL_1435515 (CHEMBL3385335)
Ki 438±n/a nM
Citation Sarikaya, BCeruso, MCarta, FSupuran, CT Inhibition of carbonic anhydrase isoforms I, II, IX and XII with novel Schiff bases: identification of selective inhibitors for the tumor-associated isoforms over the cytosolic ones. Bioorg Med Chem22:5883-90 (2014) 
 
Carbonic anhydrase 12
Name:Carbonic anhydrase 12
Type:Enzyme
Mol. Mass.:39456.00
Organism:Homo sapiens (Human)
Description:Catalytic domain of human cloned isozyme was used in the assay
Residue:354
BDBM50029076
NameBDBM50029076
Synonyms:CHEMBL3343270
TypeSmall organic molecule
Emp. Form.C16H18N2O4S
Mol. Mass.334.39
SMILESCOc1ccc(\C=N\CCc2ccc(cc2)S(N)(=O)=O)c(O)c1