Reaction Details
TargetProthrombin
LigandBDBM50029090
Substrate/Competitorn/a
Meas. Tech.ChEMBL_1435546 (CHEMBL3385911)
Ki 0.096000±n/a nM
Citation Belviso, BDCaliandro, Rde Candia, MZaetta, GLopopolo, GIncampo, FColucci, MAltomare, CD How aß-D-glucoside side chain enhances binding affinity to thrombin of inhibitors bearing 2-chlorothiophene as P1 moiety: crystallography, fragment deconstruction study, and evaluation of antithrombotic properties. J Med Chem57:8563-75 (2014) 
 
Prothrombin
Name:Prothrombin
Type:Enzyme
Mol. Mass.:70502.73
Organism:Bos taurus (Bovine)
Description:P00735
Residue:625
BDBM50029090
NameBDBM50029090
Synonyms:CHEMBL3343301
TypeSmall organic molecule
Emp. Form.C32H42ClN3O10S
Mol. Mass.696.208
SMILESCC(C)N1CCC(CC1)C(=O)Nc1c(OCCCO[C@@H]2O[C@H](CO)[C@@H](O)[C@H](O)[C@H]2O)cccc1OCc1cc(on1)-c1ccc(Cl)s1